{"text_format":"1","workbook":"xlsx","n_sheets":7,"sheets":["Data Entry","House Set Up - Adjustable","House Set Up - Fixed","Pick list","Standards","statistical calculations","Help"],"not_rendered":{"charts":0,"images":2,"macros":1,"external_links":0,"defined_names":2,"comments":0,"pivot_tables":0},"unopened":[],"bounds":{"document_bytes":16777216,"sheet_cells":100000,"rows_first":2000,"rows_last":500,"rows_between":2000,"halvings":0,"cell_chars":16384,"cell_head_chars":4096},"cells_cut":0,"cells_raw":0,"read":"whole","date_system":"1900"}

{"sheet":"Data Entry","index":0,"n_rows":22,"n_cols":12,"rows_kept":22,"cut":false,"hidden":false,"merged":[[15,10,16,10],[21,6,21,10],[3,9,4,9],[15,6,16,6],[15,7,16,7],[15,9,16,9]]}
[]
[null,"House Details",null,null,null,null,"Bird Details",null,null,null,null,"Equipment"]
[]
[null,"House Length (ft)",null,null,"House Area (ft2)",null,"Sex",null,null,"Stocking Density (ft2/bird)",null,"Feeder Type"]
[null,"House width (ft)",null,null,{"$f":"IF(C4=\"\",\"\",C4*C5)","v":""},null,"Age (w)"]
[null,"Number of pens",null,null,{"$f":"IF(H14=\"3-way Grade\",IF(C6<3,\"Error 3 pens required\",\"\"),\"\")","v":""},null,"Number of birds",null,null,{"$f":"IF(H6=\"\",\"\",E5/H6)","v":""}]
[null,"Fixed or adjustable pens",null,null,null,null,"Sample wt (lb)",null,null,"Target",null,"Drinker Type"]
[null,null,null,null,null,null,"Sample %CV",null,null,{"$f":"IF(H4=\"\",\"\",IF(H4=\"Female\",\"1.5 - 2.7 ft2 / bird\",\"2.7 - 3.6 ft2 / bird\"))","v":""}]
[null,null,null,null,{"$f":"IF(C7=\"Fixed\",\"Pen Area (ft2)\",\"\")","v":""}]
[null,{"$f":"IF(C$7=\"Fixed\",\"Pen 1 Length (ft)\",\"\")","v":""},null,null,{"$f":"IF(B10=\"\",\"\",C10*C$5)","v":""},null,"Or enter:"]
{"$rows_left_out":13}
{"sheet":"House Set Up - Adjustable","index":1,"n_rows":19,"n_cols":14,"rows_kept":19,"cut":false,"hidden":false,"merged":[[14,5,14,6],[2,11,2,13],[2,8,2,10]]}
[]
[null,"Pen Type:",{"$f":"'Data Entry'!C7","v":0},null,"Grading Type",{"$f":"'Data Entry'!H14","v":""}]
[null,null,null,null,null,null,null,null,"Feeders Required",null,null,"Drinkers Required"]
[null,null,"Weight Allocation","Pen Floor Area (ft2)","Pen Length (ft)","Number of Birds","% of Birds","Stocking Density (ft2 / bird)",{"$f":"CONCATENATE(\"Track length (ft) required at \",'Data Entry'!H5,\"w \",\"at \",'Pick list'!C18,\" in/b\")","v":"Track length (ft) required at w at 2 in/b"},{"$f":"CONCATENATE(\"Track length (ft) required at 20w at \",'Pick list'!C27,\" in/b\")","v":"Track length (ft) required at 20w at 6 in/b"},"Pans","Nipples","Cups","Bells"]
[null,{"$f":"IF(C$2=\"Adjustable\",\"Pen 1\",\"\")","v":""},{"$f":"IF(B5=\"\",\"\",IF($F$2=\"2-way Grade\",VLOOKUP('Data Entry'!C$6,'Pick list'!$K$19:$T$25,3),VLOOKUP('Data Entry'!C$6,'Pick list'!$K$10:$U$16,3)))","v":""},{"$f":"IF($B5=\"\",\"\",(VLOOKUP($C5,'Pick list'!$B$11:$F$13,5))/(COUNTIF('House Set Up - Adjustable'!$C$5:$C$12,$C5)))","v":""},{"$f":"IF(B5=\"\",\"\",D5/'Data Entry'!$C$5)","v":""},{"$f":"IF($B5=\"\",\"\",(VLOOKUP($C5,'Pick list'!$B$11:$F$13,2))/(COUNTIF('House Set Up - Adjustable'!$C$5:$C$12,$C5)))","v":""},{"$f":"IF(B5=\"\",\"\",(F5/'Data Entry'!$H$6)*100)","v":""},{"$f":"IF(B5=\"\",\"\",D5/F5)","v":""},{"$f":"IF('Data Entry'!$L$5=\"Track\",IF($F5=\"\",\"\",(ROUNDUP($F5*('Pick list'!$C$18/24),0))),\"\")","v":""},{"$f":"IF('Data Entry'!$L$5=\"Track\",IF($F5=\"\",\"\",(ROUNDUP($F5*('Pick list'!$C$27/24),0))),\"\")","v":""},{"$f":"IF('Data Entry'!$L$5=\"Pans\",IF(F5=\"\",\"\",(ROUNDUP((F5/'Pick list'!$C$19),0))),\"\")","v":""},{"$f":"IF('Data Entry'!$L$8=\"Nipples\",IF(F5=\"\",\"\",(ROUNDUP((F5/'Pick list'!$C$21),0))),\"\")","v":""},{"$f":"IF('Data Entry'!$L$8=\"Cups\",IF(F5=\"\",\"\",(ROUNDUP((F5/'Pick list'!$C$22),0))),\"\")","v":""},{"$f":"IF('Data Entry'!$L$8=\"Bells\",IF(F5=\"\",\"\",(ROUNDUP((F5/'Pick list'!$C$20),0))),\"\")","v":""}]
[null,{"$f":"IF(C$2=\"Adjustable\",\"Pen 2\",\"\")","v":""},{"$f":"IF(B6=\"\",\"\",IF($F$2=\"2-way Grade\",VLOOKUP('Data Entry'!C$6,'Pick list'!$K$19:$T$25,4),VLOOKUP('Data Entry'!C$6,'Pick list'!$K$10:$U$16,4)))","v":""},{"$f":"IF($B6=\"\",\"\",(VLOOKUP($C6,'Pick list'!$B$11:$F$13,5))/(COUNTIF('House Set Up - Adjustable'!$C$5:$C$12,$C6)))","v":""},{"$f":"IF(B6=\"\",\"\",D6/'Data Entry'!$C$5)","v":""},{"$f":"IF($B6=\"\",\"\",(VLOOKUP($C6,'Pick list'!$B$11:$F$13,2))/(COUNTIF('House Set Up - Adjustable'!$C$5:$C$12,$C6)))","v":""},{"$f":"IF(B6=\"\",\"\",(F6/'Data Entry'!$H$6)*100)","v":""},{"$f":"IF(B6=\"\",\"\",D6/F6)","v":""},{"$f":"IF('Data Entry'!$L$5=\"Track\",IF($F6=\"\",\"\",(ROUNDUP($F6*('Pick list'!$C$18/24),0))),\"\")","v":""},{"$f":"IF('Data Entry'!$L$5=\"Track\",IF($F6=\"\",\"\",(ROUNDUP($F6*('Pick list'!$C$27/24),0))),\"\")","v":""},{"$f":"IF('Data Entry'!$L$5=\"Pans\",IF(F6=\"\",\"\",(ROUNDUP((F6/'Pick list'!$C$19),0))),\"\")","v":""},{"$f":"IF('Data Entry'!$L$8=\"Nipples\",IF(F6=\"\",\"\",(ROUNDUP((F6/'Pick list'!$C$21),0))),\"\")","v":""},{"$f":"IF('Data Entry'!$L$8=\"Cups\",IF(F6=\"\",\"\",(ROUNDUP((F6/'Pick list'!$C$22),0))),\"\")","v":""},{"$f":"IF('Data Entry'!$L$8=\"Bells\",IF(F6=\"\",\"\",(ROUNDUP((F6/'Pick list'!$C$20),0))),\"\")","v":""}]
[null,{"$f":"IF(C$2=\"Adjustable\",IF('Data Entry'!C$6>2,\"Pen 3\",\"\"),\"\")","v":""},{"$f":"IF(B7=\"\",\"\",IF($F$2=\"2-way Grade\",VLOOKUP('Data Entry'!C$6,'Pick list'!$K$19:$T$25,5),VLOOKUP('Data Entry'!C$6,'Pick list'!$K$10:$U$16,5)))","v":""},{"$f":"IF($B7=\"\",\"\",(VLOOKUP($C7,'Pick list'!$B$11:$F$13,5))/(COUNTIF('House Set Up - Adjustable'!$C$5:$C$12,$C7)))","v":""},{"$f":"IF(B7=\"\",\"\",D7/'Data Entry'!$C$5)","v":""},{"$f":"IF($B7=\"\",\"\",(VLOOKUP($C7,'Pick list'!$B$11:$F$13,2))/(COUNTIF('House Set Up - Adjustable'!$C$5:$C$12,$C7)))","v":""},{"$f":"IF(B7=\"\",\"\",(F7/'Data Entry'!$H$6)*100)","v":""},"",{"$f":"IF('Data Entry'!$L$5=\"Track\",IF($F7=\"\",\"\",(ROUNDUP($F7*('Pick list'!$C$18/24),0))),\"\")","v":""},{"$f":"IF('Data Entry'!$L$5=\"Track\",IF($F7=\"\",\"\",(ROUNDUP($F7*('Pick list'!$C$27/24),0))),\"\")","v":""},{"$f":"IF('Data Entry'!$L$5=\"Pans\",IF(F7=\"\",\"\",(ROUNDUP((F7/'Pick list'!$C$19),0))),\"\")","v":""},{"$f":"IF('Data Entry'!$L$8=\"Nipples\",IF(F7=\"\",\"\",(ROUNDUP((F7/'Pick list'!$C$21),0))),\"\")","v":""},{"$f":"IF('Data Entry'!$L$8=\"Cups\",IF(F7=\"\",\"\",(ROUNDUP((F7/'Pick list'!$C$22),0))),\"\")","v":""},{"$f":"IF('Data Entry'!$L$8=\"Bells\",IF(F7=\"\",\"\",(ROUNDUP((F7/'Pick list'!$C$20),0))),\"\")","v":""}]
[null,{"$f":"IF(C$2=\"Adjustable\",IF('Data Entry'!C$6>3,\"Pen 4\",\"\"),\"\")","v":""},{"$f":"IF(B8=\"\",\"\",IF($F$2=\"2-way Grade\",VLOOKUP('Data Entry'!C$6,'Pick list'!$K$19:$T$25,6),VLOOKUP('Data Entry'!C$6,'Pick list'!$K$10:$U$16,6)))","v":""},{"$f":"IF($B8=\"\",\"\",(VLOOKUP($C8,'Pick list'!$B$11:$F$13,5))/(COUNTIF('House Set Up - Adjustable'!$C$5:$C$12,$C8)))","v":""},{"$f":"IF(B8=\"\",\"\",D8/'Data Entry'!$C$5)","v":""},{"$f":"IF($B8=\"\",\"\",(VLOOKUP($C8,'Pick list'!$B$11:$F$13,2))/(COUNTIF('House Set Up - Adjustable'!$C$5:$C$12,$C8)))","v":""},{"$f":"IF(B8=\"\",\"\",(F8/'Data Entry'!$H$6)*100)","v":""},"",{"$f":"IF('Data Entry'!$L$5=\"Track\",IF($F8=\"\",\"\",(ROUNDUP($F8*('Pick list'!$C$18/24),0))),\"\")","v":""},{"$f":"IF('Data Entry'!$L$5=\"Track\",IF($F8=\"\",\"\",(ROUNDUP($F8*('Pick list'!$C$27/24),0))),\"\")","v":""},{"$f":"IF('Data Entry'!$L$5=\"Pans\",IF(F8=\"\",\"\",(ROUNDUP((F8/'Pick list'!$C$19),0))),\"\")","v":""},{"$f":"IF('Data Entry'!$L$8=\"Nipples\",IF(F8=\"\",\"\",(ROUNDUP((F8/'Pick list'!$C$21),0))),\"\")","v":""},{"$f":"IF('Data Entry'!$L$8=\"Cups\",IF(F8=\"\",\"\",(ROUNDUP((F8/'Pick list'!$C$22),0))),\"\")","v":""},{"$f":"IF('Data Entry'!$L$8=\"Bells\",IF(F8=\"\",\"\",(ROUNDUP((F8/'Pick list'!$C$20),0))),\"\")","v":""}]
[null,{"$f":"IF(C$2=\"Adjustable\",IF('Data Entry'!C$6>4,\"Pen 5\",\"\"),\"\")","v":""},{"$f":"IF(B9=\"\",\"\",IF($F$2=\"2-way Grade\",VLOOKUP('Data Entry'!C$6,'Pick list'!$K$19:$T$25,7),VLOOKUP('Data Entry'!C$6,'Pick list'!$K$10:$U$16,7)))","v":""},{"$f":"IF($B9=\"\",\"\",(VLOOKUP($C9,'Pick list'!$B$11:$F$13,5))/(COUNTIF('House Set Up - Adjustable'!$C$5:$C$12,$C9)))","v":""},{"$f":"IF(B9=\"\",\"\",D9/'Data Entry'!$C$5)","v":""},{"$f":"IF($B9=\"\",\"\",(VLOOKUP($C9,'Pick list'!$B$11:$F$13,2))/(COUNTIF('House Set Up - Adjustable'!$C$5:$C$12,$C9)))","v":""},{"$f":"IF(B9=\"\",\"\",(F9/'Data Entry'!$H$6)*100)","v":""},"",{"$f":"IF('Data Entry'!$L$5=\"Track\",IF($F9=\"\",\"\",(ROUNDUP($F9*('Pick list'!$C$18/24),0))),\"\")","v":""},{"$f":"IF('Data Entry'!$L$5=\"Track\",IF($F9=\"\",\"\",(ROUNDUP($F9*('Pick list'!$C$27/24),0))),\"\")","v":""},{"$f":"IF('Data Entry'!$L$5=\"Pans\",IF(F9=\"\",\"\",(ROUNDUP((F9/'Pick list'!$C$19),0))),\"\")","v":""},{"$f":"IF('Data Entry'!$L$8=\"Nipples\",IF(F9=\"\",\"\",(ROUNDUP((F9/'Pick list'!$C$21),0))),\"\")","v":""},{"$f":"IF('Data Entry'!$L$8=\"Cups\",IF(F9=\"\",\"\",(ROUNDUP((F9/'Pick list'!$C$22),0))),\"\")","v":""},{"$f":"IF('Data Entry'!$L$8=\"Bells\",IF(F9=\"\",\"\",(ROUNDUP((F9/'Pick list'!$C$20),0))),\"\")","v":""}]
[null,{"$f":"IF(C$2=\"Adjustable\",IF('Data Entry'!C$6>5,\"Pen 6\",\"\"),\"\")","v":""},{"$f":"IF(B10=\"\",\"\",IF($F$2=\"2-way Grade\",VLOOKUP('Data Entry'!C$6,'Pick list'!$K$19:$T$25,8),VLOOKUP('Data Entry'!C$6,'Pick list'!$K$10:$U$16,8)))","v":""},{"$f":"IF($B10=\"\",\"\",(VLOOKUP($C10,'Pick list'!$B$11:$F$13,5))/(COUNTIF('House Set Up - Adjustable'!$C$5:$C$12,$C10)))","v":""},{"$f":"IF(B10=\"\",\"\",D10/'Data Entry'!$C$5)","v":""},{"$f":"IF($B10=\"\",\"\",(VLOOKUP($C10,'Pick list'!$B$11:$F$13,2))/(COUNTIF('House Set Up - Adjustable'!$C$5:$C$12,$C10)))","v":""},{"$f":"IF(B10=\"\",\"\",(F10/'Data Entry'!$H$6)*100)","v":""},"",{"$f":"IF('Data Entry'!$L$5=\"Track\",IF($F10=\"\",\"\",(ROUNDUP($F10*('Pick list'!$C$18/24),0))),\"\")","v":""},{"$f":"IF('Data Entry'!$L$5=\"Track\",IF($F10=\"\",\"\",(ROUNDUP($F10*('Pick list'!$C$27/24),0))),\"\")","v":""},{"$f":"IF('Data Entry'!$L$5=\"Pans\",IF(F10=\"\",\"\",(ROUNDUP((F10/'Pick list'!$C$19),0))),\"\")","v":""},{"$f":"IF('Data Entry'!$L$8=\"Nipples\",IF(F10=\"\",\"\",(ROUNDUP((F10/'Pick list'!$C$21),0))),\"\")","v":""},{"$f":"IF('Data Entry'!$L$8=\"Cups\",IF(F10=\"\",\"\",(ROUNDUP((F10/'Pick list'!$C$22),0))),\"\")","v":""},{"$f":"IF('Data Entry'!$L$8=\"Bells\",IF(F10=\"\",\"\",(ROUNDUP((F10/'Pick list'!$C$20),0))),\"\")","v":""}]
{"$rows_left_out":10}
{"sheet":"House Set Up - Fixed","index":2,"n_rows":19,"n_cols":14,"rows_kept":19,"cut":false,"hidden":false,"merged":[[14,5,14,6],[2,11,2,13],[2,8,2,10]]}
[]
[null,"Pen Type:",{"$f":"'Data Entry'!C7","v":0},null,"Grading Type",{"$f":"'Data Entry'!H14","v":""}]
[null,null,null,null,null,null,null,null,"Feeders Required",null,null,"Drinkers Required"]
[null,null,"Weight Allocation","Pen Floor Area (ft2)","Number of Birds","% of the Total Birds","Ideal % of Birds","Stocking Density (ft2/bird)",{"$f":"CONCATENATE(\"Track length (ft) required at \",'Data Entry'!H5,\"w \",\"at \",'Pick list'!C18,\"in/b\")","v":"Track length (ft) required at w at 2in/b"},{"$f":"CONCATENATE(\"Track length (ft) required at 20w at \",'Pick list'!C27,\"in/b\")","v":"Track length (ft) required at 20w at 6in/b"},"Pans","Nipples","Cups","Bells"]
[null,{"$f":"IF('Data Entry'!B10=\"\",\"\",\"Pen 1\")","v":""},null,{"$f":"IF(B5=\"\",\"\",'Data Entry'!E10)","v":""},{"$f":"IF(B5=\"\",\"\",D5/'Data Entry'!$J$6)","v":""},{"$f":"IF(E5=\"\",\"\",(E5/'Data Entry'!$H$6)*100)","v":""},{"$f":"IF(B5=\"\",\"\",(VLOOKUP(C5,'Pick list'!$B$11:$E$13,4))/((VLOOKUP(C5,'Pick list'!$B$11:$E$13,3))/D5))","v":""},{"$f":"IF(B5=\"\",\"\",D5/E5)","v":""},{"$f":"IF('Data Entry'!$L$5=\"Track\",IF($E5=\"\",\"\",(ROUNDUP($E5*('Pick list'!$C$18/24),0))),\"\")","v":""},{"$f":"IF('Data Entry'!$L$5=\"Track\",IF($E5=\"\",\"\",(ROUNDUP($E5*('Pick list'!$C$27/24),0))),\"\")","v":""},{"$f":"IF('Data Entry'!$L$5=\"Pans\",IF(E5=\"\",\"\",(ROUNDUP((E5/'Pick list'!$C$19),0))),\"\")","v":""},{"$f":"IF('Data Entry'!$L$8=\"Nipples\",IF(E5=\"\",\"\",(ROUNDUP((E5/'Pick list'!$C$21),0))),\"\")","v":""},{"$f":"IF('Data Entry'!$L$8=\"Cups\",IF(E5=\"\",\"\",(ROUNDUP((E5/'Pick list'!$C$22),0))),\"\")","v":""},{"$f":"IF('Data Entry'!$L$8=\"Bells\",IF(E5=\"\",\"\",(ROUNDUP((E5/'Pick list'!$C$20),0))),\"\")","v":""}]
[null,{"$f":"IF('Data Entry'!B11=\"\",\"\",\"Pen 2\")","v":""},null,{"$f":"IF(B6=\"\",\"\",'Data Entry'!E11)","v":""},{"$f":"IF(B6=\"\",\"\",D6/'Data Entry'!$J$6)","v":""},{"$f":"IF(E6=\"\",\"\",(E6/'Data Entry'!$H$6)*100)","v":""},{"$f":"IF(B6=\"\",\"\",(VLOOKUP(C6,'Pick list'!$B$11:$E$13,4))/((VLOOKUP(C6,'Pick list'!$B$11:$E$13,3))/D6))","v":""},{"$f":"IF(B6=\"\",\"\",D6/E6)","v":""},{"$f":"IF('Data Entry'!$L$5=\"Track\",IF($E6=\"\",\"\",(ROUNDUP($E6*('Pick list'!$C$18/24),0))),\"\")","v":""},{"$f":"IF('Data Entry'!$L$5=\"Track\",IF($E6=\"\",\"\",(ROUNDUP($E6*('Pick list'!$C$27/24),0))),\"\")","v":""},{"$f":"IF('Data Entry'!$L$5=\"Pans\",IF(E6=\"\",\"\",(ROUNDUP((E6/'Pick list'!$C$19),0))),\"\")","v":""},{"$f":"IF('Data Entry'!$L$8=\"Nipples\",IF(E6=\"\",\"\",(ROUNDUP((E6/'Pick list'!$C$21),0))),\"\")","v":""},{"$f":"IF('Data Entry'!$L$8=\"Cups\",IF(E6=\"\",\"\",(ROUNDUP((E6/'Pick list'!$C$22),0))),\"\")","v":""},{"$f":"IF('Data Entry'!$L$8=\"Bells\",IF(E6=\"\",\"\",(ROUNDUP((E6/'Pick list'!$C$20),0))),\"\")","v":""}]
[null,{"$f":"IF('Data Entry'!B12=\"\",\"\",\"Pen 3\")","v":""},null,{"$f":"IF(B7=\"\",\"\",'Data Entry'!E12)","v":""},{"$f":"IF(B7=\"\",\"\",D7/'Data Entry'!$J$6)","v":""},{"$f":"IF(E7=\"\",\"\",(E7/'Data Entry'!$H$6)*100)","v":""},{"$f":"IF(B7=\"\",\"\",(VLOOKUP(C7,'Pick list'!$B$11:$E$13,4))/((VLOOKUP(C7,'Pick list'!$B$11:$E$13,3))/D7))","v":""},"",{"$f":"IF('Data Entry'!$L$5=\"Track\",IF($E7=\"\",\"\",(ROUNDUP($E7*('Pick list'!$C$18/24),0))),\"\")","v":""},{"$f":"IF('Data Entry'!$L$5=\"Track\",IF($E7=\"\",\"\",(ROUNDUP($E7*('Pick list'!$C$27/24),0))),\"\")","v":""},{"$f":"IF('Data Entry'!$L$5=\"Pans\",IF(E7=\"\",\"\",(ROUNDUP((E7/'Pick list'!$C$19),0))),\"\")","v":""},{"$f":"IF('Data Entry'!$L$8=\"Nipples\",IF(E7=\"\",\"\",(ROUNDUP((E7/'Pick list'!$C$21),0))),\"\")","v":""},{"$f":"IF('Data Entry'!$L$8=\"Cups\",IF(E7=\"\",\"\",(ROUNDUP((E7/'Pick list'!$C$22),0))),\"\")","v":""},{"$f":"IF('Data Entry'!$L$8=\"Bells\",IF(E7=\"\",\"\",(ROUNDUP((E7/'Pick list'!$C$20),0))),\"\")","v":""}]
[null,{"$f":"IF('Data Entry'!B13=\"\",\"\",\"Pen 4\")","v":""},null,{"$f":"IF(B8=\"\",\"\",'Data Entry'!E13)","v":""},{"$f":"IF(B8=\"\",\"\",D8/'Data Entry'!$J$6)","v":""},{"$f":"IF(E8=\"\",\"\",(E8/'Data Entry'!$H$6)*100)","v":""},{"$f":"IF(B8=\"\",\"\",(VLOOKUP(C8,'Pick list'!$B$11:$E$13,4))/((VLOOKUP(C8,'Pick list'!$B$11:$E$13,3))/D8))","v":""},"",{"$f":"IF('Data Entry'!$L$5=\"Track\",IF($E8=\"\",\"\",(ROUNDUP($E8*('Pick list'!$C$18/24),0))),\"\")","v":""},{"$f":"IF('Data Entry'!$L$5=\"Track\",IF($E8=\"\",\"\",(ROUNDUP($E8*('Pick list'!$C$27/24),0))),\"\")","v":""},{"$f":"IF('Data Entry'!$L$5=\"Pans\",IF(E8=\"\",\"\",(ROUNDUP((E8/'Pick list'!$C$19),0))),\"\")","v":""},{"$f":"IF('Data Entry'!$L$8=\"Nipples\",IF(E8=\"\",\"\",(ROUNDUP((E8/'Pick list'!$C$21),0))),\"\")","v":""},{"$f":"IF('Data Entry'!$L$8=\"Cups\",IF(E8=\"\",\"\",(ROUNDUP((E8/'Pick list'!$C$22),0))),\"\")","v":""},{"$f":"IF('Data Entry'!$L$8=\"Bells\",IF(E8=\"\",\"\",(ROUNDUP((E8/'Pick list'!$C$20),0))),\"\")","v":""}]
[null,{"$f":"IF('Data Entry'!B14=\"\",\"\",\"Pen 5\")","v":""},null,{"$f":"IF(B9=\"\",\"\",'Data Entry'!E14)","v":""},{"$f":"IF(B9=\"\",\"\",D9/'Data Entry'!$J$6)","v":""},{"$f":"IF(E9=\"\",\"\",(E9/'Data Entry'!$H$6)*100)","v":""},{"$f":"IF(B9=\"\",\"\",(VLOOKUP(C9,'Pick list'!$B$11:$E$13,4))/((VLOOKUP(C9,'Pick list'!$B$11:$E$13,3))/D9))","v":""},"",{"$f":"IF('Data Entry'!$L$5=\"Track\",IF($E9=\"\",\"\",(ROUNDUP($E9*('Pick list'!$C$18/24),0))),\"\")","v":""},{"$f":"IF('Data Entry'!$L$5=\"Track\",IF($E9=\"\",\"\",(ROUNDUP($E9*('Pick list'!$C$27/24),0))),\"\")","v":""},{"$f":"IF('Data Entry'!$L$5=\"Pans\",IF(E9=\"\",\"\",(ROUNDUP((E9/'Pick list'!$C$19),0))),\"\")","v":""},{"$f":"IF('Data Entry'!$L$8=\"Nipples\",IF(E9=\"\",\"\",(ROUNDUP((E9/'Pick list'!$C$21),0))),\"\")","v":""},{"$f":"IF('Data Entry'!$L$8=\"Cups\",IF(E9=\"\",\"\",(ROUNDUP((E9/'Pick list'!$C$22),0))),\"\")","v":""},{"$f":"IF('Data Entry'!$L$8=\"Bells\",IF(E9=\"\",\"\",(ROUNDUP((E9/'Pick list'!$C$20),0))),\"\")","v":""}]
[null,{"$f":"IF('Data Entry'!B15=\"\",\"\",\"Pen6\")","v":""},null,{"$f":"IF(B10=\"\",\"\",'Data Entry'!E15)","v":""},{"$f":"IF(B10=\"\",\"\",D10/'Data Entry'!$J$6)","v":""},{"$f":"IF(E10=\"\",\"\",(E10/'Data Entry'!$H$6)*100)","v":""},{"$f":"IF(B10=\"\",\"\",(VLOOKUP(C10,'Pick list'!$B$11:$E$13,4))/((VLOOKUP(C10,'Pick list'!$B$11:$E$13,3))/D10))","v":""},"",{"$f":"IF('Data Entry'!$L$5=\"Track\",IF($E10=\"\",\"\",(ROUNDUP($E10*('Pick list'!$C$18/24),0))),\"\")","v":""},{"$f":"IF('Data Entry'!$L$5=\"Track\",IF($E10=\"\",\"\",(ROUNDUP($E10*('Pick list'!$C$27/24),0))),\"\")","v":""},{"$f":"IF('Data Entry'!$L$5=\"Pans\",IF(E10=\"\",\"\",(ROUNDUP((E10/'Pick list'!$C$19),0))),\"\")","v":""},{"$f":"IF('Data Entry'!$L$8=\"Nipples\",IF(E10=\"\",\"\",(ROUNDUP((E10/'Pick list'!$C$21),0))),\"\")","v":""},{"$f":"IF('Data Entry'!$L$8=\"Cups\",IF(E10=\"\",\"\",(ROUNDUP((E10/'Pick list'!$C$22),0))),\"\")","v":""},{"$f":"IF('Data Entry'!$L$8=\"Bells\",IF(E10=\"\",\"\",(ROUNDUP((E10/'Pick list'!$C$20),0))),\"\")","v":""}]
{"$rows_left_out":10}
{"sheet":"Pick list","index":3,"n_rows":31,"n_cols":20,"rows_kept":31,"cut":false,"hidden":true,"merged":[]}
["Pick Lists"]
[null,"Fixed",2,"Female",2,"Light",null,"Track",null,"Nipples"]
[null,"Adjustable",3,"Male",3,"Normal",null,"Pans",null,"Cups"]
[null,null,4,null,4,"Heavy",null,null,null,"Bells"]
[null,null,5,null,5]
[null,null,6,null,6]
[null,null,7,null,7]
[null,null,8]
[null,null,null,"Fixed",null,"Adj",null,null,null,null,null,null,1,2,3,4,5,6,7,8]
["Calculations",null,"Number of birds","Pen floor area","Ideal %","Pen Floor area",null,null,null,null,2,{"$f":"'Data Entry'!$E$5/'Pick list'!K10","v":{"$error":"#VALUE!"}},"Light","Normal"]
{"$rows_left_out":22}
{"sheet":"Standards","index":4,"n_rows":67,"n_cols":7,"rows_kept":67,"cut":false,"hidden":true,"merged":[]}
[]
["Age (w)","Ross 308","Ross 708","Ross PM3","Ross 308AP","Ross 408","Ross 308FF"]
[0,40,40,null,null,null,40]
[1,115,110,null,null,null,115]
[2,215,215,null,null,null,215]
[3,335,310,null,null,null,335]
[4,450,400,null,null,null,450]
[5,560,490,null,null,null,560]
[6,660,580,null,null,null,660]
[7,760,670,null,null,null,760]
{"$rows_left_out":58}
{"sheet":"statistical calculations","index":5,"n_rows":25,"n_cols":7,"rows_kept":25,"cut":false,"hidden":true,"merged":[]}
[]
[]
[null,"Mean wt",{"$f":"'Data Entry'!H7","v":0}]
[null,"CV",{"$f":"IF(F4>0,F4,G25)","v":{"$error":"#DIV/0!"}},null,"CV",{"$f":"'Data Entry'!H8","v":0}]
[null,"Sd",{"$f":"C3*(C4/100)","v":{"$error":"#DIV/0!"}},null,"Uniformity",{"$f":"'Data Entry'!H11","v":0}]
[]
[null,null,"%","Function"]
[null,"Light",{"$f":"'House Set Up - Fixed'!D17","v":""},{"$f":"1-(C8/100)","v":{"$error":"#VALUE!"}},{"$f":"C3-(NORMINV(D8,C$3,C$5)-C3)","v":{"$error":"#VALUE!"}},{"$f":"C3-E8","v":{"$error":"#VALUE!"}}]
[null,"Heavy",{"$f":"'House Set Up - Fixed'!D19","v":""},{"$f":"1-(C9/100)","v":{"$error":"#VALUE!"}},{"$f":"NORMINV(D9,C$3,C$5)","v":{"$error":"#VALUE!"}},{"$f":"C3-E9","v":{"$error":"#VALUE!"}}]
[]
{"$rows_left_out":16}
{"sheet":"Help","index":6,"n_rows":49,"n_cols":1,"rows_kept":49,"cut":false,"hidden":false,"merged":[]}
[]
["Grading Calculator Instructions"]
["1.       The spreadsheet has been written in Excel 2010 and may not function correctly in earlier versions of Excel."]
["2.       Macros must be enabled to use this spreadsheet.  Save the spreadsheet to your computer and then when asked enable editing and enable Macros.  Please check with your local IT department if you have any problem running Macros on your computer."]
["3.       White cells are used for data input either by drop down list or actual numerical data entry when required."]
["4.       Enter data in:"]
["a.       Cell C4 – House length in meters"]
["b.      Cell C5 – House width in meters"]
["c.       Cell C6 – Number of pens in house to be graded from drop down list"]
["d.      Cell C7 – Grading pens are adjustable or fixed from drop down list"]
{"$rows_left_out":39}